{"text_format":"1","workbook":"xlsx","n_sheets":4,"sheets":["Questions","Summary","Examples - Questions","Examples - Summary"],"not_rendered":{"charts":0,"images":1,"macros":0,"external_links":0,"defined_names":0,"comments":1,"pivot_tables":0},"unopened":[],"bounds":{"document_bytes":16777216,"sheet_cells":100000,"rows_first":2000,"rows_last":500,"rows_between":2000,"halvings":0,"cell_chars":16384,"cell_head_chars":4096},"cells_cut":0,"cells_raw":0,"read":"whole","date_system":"1900"}

{"sheet":"Questions","index":0,"n_rows":93,"n_cols":54,"rows_kept":93,"cut":false,"hidden":false,"merged":[]}
[]
[null,"DATA CLASSIFICATION QUESTIONS","Default \nlevel\n(if yes)","Default \nlevel\n(if no)","<data type>","<data type>","<data type>","<data type>","<data type>","<data type>","<data type>","<data type>","<data type>","<data type>","<data type>","<data type>","<data type>","<data type>","<data type>","<data type>","<data type>","<data type>","<data type>","<data type>","<data type>","<data type>","<data type>","<data type>","<data type>","<data type>","<data type>","<data type>","<data type>","<data type>","<data type>","<data type>","<data type>","<data type>","<data type>","<data type>","<data type>","<data type>","<data type>","<data type>","<data type>","<data type>","<data type>","<data type>","<data type>","<data type>","<data type>","<data type>","<data type>","<data type>"]
[null,null,null,null,"(y/n)","(y/n)","(y/n)","(y/n)","(y/n)","(y/n)","(y/n)","(y/n)","(y/n)","(y/n)","(y/n)","(y/n)","(y/n)","(y/n)","(y/n)","(y/n)","(y/n)","(y/n)","(y/n)","(y/n)","(y/n)","(y/n)","(y/n)","(y/n)","(y/n)","(y/n)","(y/n)","(y/n)","(y/n)","(y/n)","(y/n)","(y/n)","(y/n)","(y/n)","(y/n)","(y/n)","(y/n)","(y/n)","(y/n)","(y/n)","(y/n)","(y/n)","(y/n)","(y/n)","(y/n)","(y/n)","(y/n)","(y/n)","(y/n)","(y/n)"]
[null,"Confidentiality (1 - Open,  2 - Restricted,  3 - Confidential)",null,null,{"$f":"IF(E88=0,\"\",IF(E88=1,\"Open\",IF(E88=2,\"Restricted\",IF(E88=3,\"Confidential\",\"\"))))","v":""},{"$f":"IF(F88=0,\"\",IF(F88=1,\"Open\",IF(F88=2,\"Restricted\",IF(F88=3,\"Confidential\",\"\"))))","v":""},"","","","","","","","","","","","","","","","","","","","","","","","","","","","","","","","","","","","","","","","","","","","","","","",""]
[null,"Can data be accessed publicly without special access rights (user credentials)?",1,2]
[null,"If not, does the data considered contain:"]
[null,"data related to research projects shared with the project participants",2]
[null,"financial data (e.g. budget planning, accounting reports)",2]
[null,"personal identifiable data \n(e.g. customer data, employee data, mail, accounting data, disciplinary matters, qualifications...)",2]
[null,"sensitive personal data \n(e.g. physical or mental health data, ethnic, political, ...)",3]
[null,"Data related to corporate secrets \n(e.g. formulas, procedure descriptions, contracts, finance, exam questions...)",3]
[null,"Is the data confidentiality directly associated with mission-critical business process, legal requirements or contractual obligations to the users?",1]
[]
[null,"Integrity (1 - Low, 2 - Medium, 3 - High)",null,null,{"$f":"IF(E89=0,\"\",IF(E89=1,\"Low\",IF(E89=2,\"Medium\",IF(E89=3,\"High\",\"\"))))","v":""},"","","","","","","","","","","","","","","","","","","","","","","","","","","","","","","","","","","","","","","","","","","","","","","","",""]
[null,"If the data is considered primary or unique:"]
{"$rows_left_out":79}
{"sheet":"Summary","index":1,"n_rows":52,"n_cols":9,"rows_kept":52,"cut":false,"hidden":false,"merged":[]}
[]
[null,null,null,"Confidentiality","Integrity","Accessability","Storage Period","Storage Location","Disposal rules"]
[null,1,{"$f":"IF(INDEX(Questions!$E$2:$ZZ$2,1,$B3) =\"\",\"\",INDEX(Questions!$E$2:$ZZ$2,1,$B3))","v":"<data type>"},{"$f":"INDEX(Questions!$E$4:$BB$4,1,$B3)","v":""},{"$f":"INDEX(Questions!$E$14:$BB$14,1,$B3)","v":""},{"$f":"INDEX(Questions!$E$23:$BB$23,1,$B3)","v":""},{"$f":"INDEX(Questions!$E$30:$BB$30,1,$B3)","v":""},{"$f":"INDEX(Questions!$E$37:$BB$37,1,$B3)","v":""},{"$f":"INDEX(Questions!$E$41:$BB$41,1,$B3)","v":""}]
[null,2,{"$f":"IF(INDEX(Questions!$E$2:$ZZ$2,1,$B4) =\"\",\"\",INDEX(Questions!$E$2:$ZZ$2,1,$B4))","v":"<data type>"},{"$f":"INDEX(Questions!$E$4:$BB$4,1,$B4)","v":""},{"$f":"INDEX(Questions!$E$14:$BB$14,1,$B4)","v":""},{"$f":"INDEX(Questions!$E$23:$BB$23,1,$B4)","v":""},{"$f":"INDEX(Questions!$E$30:$BB$30,1,$B4)","v":""},{"$f":"INDEX(Questions!$E$37:$BB$37,1,$B4)","v":""},{"$f":"INDEX(Questions!$E$41:$BB$41,1,$B4)","v":""}]
[null,3,{"$f":"IF(INDEX(Questions!$E$2:$ZZ$2,1,$B5) =\"\",\"\",INDEX(Questions!$E$2:$ZZ$2,1,$B5))","v":"<data type>"},{"$f":"INDEX(Questions!$E$4:$BB$4,1,$B5)","v":""},{"$f":"INDEX(Questions!$E$14:$BB$14,1,$B5)","v":""},{"$f":"INDEX(Questions!$E$23:$BB$23,1,$B5)","v":""},{"$f":"INDEX(Questions!$E$30:$BB$30,1,$B5)","v":""},{"$f":"INDEX(Questions!$E$37:$BB$37,1,$B5)","v":""},{"$f":"INDEX(Questions!$E$41:$BB$41,1,$B5)","v":""}]
[null,4,{"$f":"IF(INDEX(Questions!$E$2:$ZZ$2,1,$B6) =\"\",\"\",INDEX(Questions!$E$2:$ZZ$2,1,$B6))","v":"<data type>"},{"$f":"INDEX(Questions!$E$4:$BB$4,1,$B6)","v":""},{"$f":"INDEX(Questions!$E$14:$BB$14,1,$B6)","v":""},{"$f":"INDEX(Questions!$E$23:$BB$23,1,$B6)","v":""},{"$f":"INDEX(Questions!$E$30:$BB$30,1,$B6)","v":""},{"$f":"INDEX(Questions!$E$37:$BB$37,1,$B6)","v":""},{"$f":"INDEX(Questions!$E$41:$BB$41,1,$B6)","v":""}]
[null,5,{"$f":"IF(INDEX(Questions!$E$2:$ZZ$2,1,$B7) =\"\",\"\",INDEX(Questions!$E$2:$ZZ$2,1,$B7))","v":"<data type>"},{"$f":"INDEX(Questions!$E$4:$BB$4,1,$B7)","v":""},{"$f":"INDEX(Questions!$E$14:$BB$14,1,$B7)","v":""},{"$f":"INDEX(Questions!$E$23:$BB$23,1,$B7)","v":""},{"$f":"INDEX(Questions!$E$30:$BB$30,1,$B7)","v":""},{"$f":"INDEX(Questions!$E$37:$BB$37,1,$B7)","v":""},{"$f":"INDEX(Questions!$E$41:$BB$41,1,$B7)","v":""}]
[null,6,{"$f":"IF(INDEX(Questions!$E$2:$ZZ$2,1,$B8) =\"\",\"\",INDEX(Questions!$E$2:$ZZ$2,1,$B8))","v":"<data type>"},{"$f":"INDEX(Questions!$E$4:$BB$4,1,$B8)","v":""},{"$f":"INDEX(Questions!$E$14:$BB$14,1,$B8)","v":""},{"$f":"INDEX(Questions!$E$23:$BB$23,1,$B8)","v":""},{"$f":"INDEX(Questions!$E$30:$BB$30,1,$B8)","v":""},{"$f":"INDEX(Questions!$E$37:$BB$37,1,$B8)","v":""},{"$f":"INDEX(Questions!$E$41:$BB$41,1,$B8)","v":""}]
[null,7,{"$f":"IF(INDEX(Questions!$E$2:$ZZ$2,1,$B9) =\"\",\"\",INDEX(Questions!$E$2:$ZZ$2,1,$B9))","v":"<data type>"},{"$f":"INDEX(Questions!$E$4:$BB$4,1,$B9)","v":""},{"$f":"INDEX(Questions!$E$14:$BB$14,1,$B9)","v":""},{"$f":"INDEX(Questions!$E$23:$BB$23,1,$B9)","v":""},{"$f":"INDEX(Questions!$E$30:$BB$30,1,$B9)","v":""},{"$f":"INDEX(Questions!$E$37:$BB$37,1,$B9)","v":""},{"$f":"INDEX(Questions!$E$41:$BB$41,1,$B9)","v":""}]
[null,8,{"$f":"IF(INDEX(Questions!$E$2:$ZZ$2,1,$B10) =\"\",\"\",INDEX(Questions!$E$2:$ZZ$2,1,$B10))","v":"<data type>"},{"$f":"INDEX(Questions!$E$4:$BB$4,1,$B10)","v":""},{"$f":"INDEX(Questions!$E$14:$BB$14,1,$B10)","v":""},{"$f":"INDEX(Questions!$E$23:$BB$23,1,$B10)","v":""},{"$f":"INDEX(Questions!$E$30:$BB$30,1,$B10)","v":""},{"$f":"INDEX(Questions!$E$37:$BB$37,1,$B10)","v":""},{"$f":"INDEX(Questions!$E$41:$BB$41,1,$B10)","v":""}]
[null,9,{"$f":"IF(INDEX(Questions!$E$2:$ZZ$2,1,$B11) =\"\",\"\",INDEX(Questions!$E$2:$ZZ$2,1,$B11))","v":"<data type>"},{"$f":"INDEX(Questions!$E$4:$BB$4,1,$B11)","v":""},{"$f":"INDEX(Questions!$E$14:$BB$14,1,$B11)","v":""},{"$f":"INDEX(Questions!$E$23:$BB$23,1,$B11)","v":""},{"$f":"INDEX(Questions!$E$30:$BB$30,1,$B11)","v":""},{"$f":"INDEX(Questions!$E$37:$BB$37,1,$B11)","v":""},{"$f":"INDEX(Questions!$E$41:$BB$41,1,$B11)","v":""}]
[null,10,{"$f":"IF(INDEX(Questions!$E$2:$ZZ$2,1,$B12) =\"\",\"\",INDEX(Questions!$E$2:$ZZ$2,1,$B12))","v":"<data type>"},{"$f":"INDEX(Questions!$E$4:$BB$4,1,$B12)","v":""},{"$f":"INDEX(Questions!$E$14:$BB$14,1,$B12)","v":""},{"$f":"INDEX(Questions!$E$23:$BB$23,1,$B12)","v":""},{"$f":"INDEX(Questions!$E$30:$BB$30,1,$B12)","v":""},{"$f":"INDEX(Questions!$E$37:$BB$37,1,$B12)","v":""},{"$f":"INDEX(Questions!$E$41:$BB$41,1,$B12)","v":""}]
[null,11,{"$f":"IF(INDEX(Questions!$E$2:$ZZ$2,1,$B13) =\"\",\"\",INDEX(Questions!$E$2:$ZZ$2,1,$B13))","v":"<data type>"},{"$f":"INDEX(Questions!$E$4:$BB$4,1,$B13)","v":""},{"$f":"INDEX(Questions!$E$14:$BB$14,1,$B13)","v":""},{"$f":"INDEX(Questions!$E$23:$BB$23,1,$B13)","v":""},{"$f":"INDEX(Questions!$E$30:$BB$30,1,$B13)","v":""},{"$f":"INDEX(Questions!$E$37:$BB$37,1,$B13)","v":""},{"$f":"INDEX(Questions!$E$41:$BB$41,1,$B13)","v":""}]
[null,12,{"$f":"IF(INDEX(Questions!$E$2:$ZZ$2,1,$B14) =\"\",\"\",INDEX(Questions!$E$2:$ZZ$2,1,$B14))","v":"<data type>"},{"$f":"INDEX(Questions!$E$4:$BB$4,1,$B14)","v":""},{"$f":"INDEX(Questions!$E$14:$BB$14,1,$B14)","v":""},{"$f":"INDEX(Questions!$E$23:$BB$23,1,$B14)","v":""},{"$f":"INDEX(Questions!$E$30:$BB$30,1,$B14)","v":""},{"$f":"INDEX(Questions!$E$37:$BB$37,1,$B14)","v":""},{"$f":"INDEX(Questions!$E$41:$BB$41,1,$B14)","v":""}]
[null,13,{"$f":"IF(INDEX(Questions!$E$2:$ZZ$2,1,$B15) =\"\",\"\",INDEX(Questions!$E$2:$ZZ$2,1,$B15))","v":"<data type>"},{"$f":"INDEX(Questions!$E$4:$BB$4,1,$B15)","v":""},{"$f":"INDEX(Questions!$E$14:$BB$14,1,$B15)","v":""},{"$f":"INDEX(Questions!$E$23:$BB$23,1,$B15)","v":""},{"$f":"INDEX(Questions!$E$30:$BB$30,1,$B15)","v":""},{"$f":"INDEX(Questions!$E$37:$BB$37,1,$B15)","v":""},{"$f":"INDEX(Questions!$E$41:$BB$41,1,$B15)","v":""}]
{"$rows_left_out":38}
{"sheet":"Examples - Questions","index":2,"n_rows":93,"n_cols":54,"rows_kept":93,"cut":false,"hidden":false,"merged":[]}
[]
[null,"DATA CLASSIFICATION QUESTIONS","Default \nlevel\n(if yes)","Default \nlevel\n(if no)","eLearning\nCourses info","eLearning\nLearning materials","eLearning\nExam questions","Repository of doctoral thesis","Research project\nRaw data from IoT","Research project\nScientific paper","Network Management\nmonitoring","Network Management\neduroam logs","Network Management\nrouter config files","Network Management\nreports to customers","ERP system\nFinancial data","<data type>","<data type>","<data type>","<data type>","<data type>","<data type>","<data type>","<data type>","<data type>","<data type>","<data type>","<data type>","<data type>","<data type>","<data type>","<data type>","<data type>","<data type>","<data type>","<data type>","<data type>","<data type>","<data type>","<data type>","<data type>","<data type>","<data type>","<data type>","<data type>","<data type>","<data type>","<data type>","<data type>","<data type>","<data type>","<data type>","<data type>","<data type>","<data type>"]
[null,null,null,null,"(y/n)","(y/n)","(y/n)","(y/n)","(y/n)","(y/n)","(y/n)","(y/n)","(y/n)","(y/n)","(y/n)","(y/n)","(y/n)","(y/n)","(y/n)","(y/n)","(y/n)","(y/n)","(y/n)","(y/n)","(y/n)","(y/n)","(y/n)","(y/n)","(y/n)","(y/n)","(y/n)","(y/n)","(y/n)","(y/n)","(y/n)","(y/n)","(y/n)","(y/n)","(y/n)","(y/n)","(y/n)","(y/n)","(y/n)","(y/n)","(y/n)","(y/n)","(y/n)","(y/n)","(y/n)","(y/n)","(y/n)","(y/n)","(y/n)","(y/n)"]
[null,"Confidentiality (1 - Open,  2 - Restricted,  3 - Confidential)",null,null,{"$f":"IF(E88=0,\"\",IF(E88=1,\"Open\",IF(E88=2,\"Restricted\",IF(E88=3,\"Confidential\",\"\"))))","v":"Confidential"},"Restricted","Confidential","Open","Restricted","Confidential","Restricted","Confidential","Confidential","Open","Confidential",{"$f":"IF(P88=0,\"\",IF(P88=1,\"Open\",IF(P88=2,\"Restricted\",IF(P88=3,\"Confidental\",\"\"))))","v":""},"","","","","","","","","","","","","","","","","","","","","","","","","","","","","","","","","","","","","",""]
[null,"Can data be accessed publicly without special access rights (user credentials)?",1,2,"y","n","n","y","n","n","n","n","n","y","n"]
[null,"If not, does the data considered contain:"]
[null,"data related to research projects shared with the project participants",2,null,null,null,null,null,"y","y"]
[null,"financial data (e.g. budget planning, accounting reports)",2,null,null,null,null,null,null,null,null,null,null,null,"y"]
[null,"personal identifiable data \n(e.g. customer data, employee data, mail, accounting data, disciplinary matters, qualifications...)",2,null,null,null,null,null,null,null,null,"y"]
[null,"sensitive personal data \n(e.g. physical or mental health data, ethnic, political, ...)",3,null,null,null,null,null,null,null,"n",null,null,null,"y"]
[null,"Data related to corporate secrets \n(e.g. formulas, procedure descriptions, contracts, finance, exam questions...)",3,null,"y",null,"y",null,null,"y","n",null,"y"]
[null,"Is the data confidentiality directly associated with mission-critical business process, legal requirements or contractual obligations to the users?",1,null,null,null,"y","y",null,null,"n","y","y",null,"y"]
[]
[null,"Integrity (1 - Low, 2 - Medium, 3 - High)",null,null,{"$f":"IF(E89=0,\"\",IF(E89=1,\"Low\",IF(E89=2,\"Medium\",IF(E89=3,\"High\",\"\"))))","v":"Low"},"Low","High","High","Medium","Low","Medium","Medium","Low","Low","High","","","","","","","","","","","","","","","","","","","","","","","","","","","","","","","","","","","","","","",""]
[null,"If the data is considered primary or unique:"]
{"$rows_left_out":79}
{"sheet":"Examples - Summary","index":3,"n_rows":52,"n_cols":9,"rows_kept":52,"cut":false,"hidden":false,"merged":[]}
[]
[null,null,null,"Confidentiality","Integrity","Accessability","Storage Period","Storage Location","Disposal rules"]
[null,1,{"$f":"IF(INDEX('Examples - Questions'!$E$2:$ZZ$2,1,$B3) =\"\",\"\",INDEX('Examples - Questions'!$E$2:$ZZ$2,1,$B3))","v":"eLearning\nCourses info"},{"$f":"INDEX('Examples - Questions'!$E$4:$BB$4,1,$B3)","v":"Confidential"},{"$f":"INDEX('Examples - Questions'!$E$14:$BB$14,1,$B3)","v":"Low"},{"$f":"INDEX('Examples - Questions'!$E$23:$BB$23,1,$B3)","v":"Medium"},{"$f":"INDEX('Examples - Questions'!$E$30:$BB$30,1,$B3)","v":"Fixed"},{"$f":"INDEX('Examples - Questions'!$E$37:$BB$37,1,$B3)","v":"Any"},{"$f":"INDEX('Examples - Questions'!$E$41:$BB$41,1,$B3)","v":"High"}]
[null,2,{"$f":"IF(INDEX('Examples - Questions'!$E$2:$ZZ$2,1,$B4) =\"\",\"\",INDEX('Examples - Questions'!$E$2:$ZZ$2,1,$B4))","v":"eLearning\nLearning materials"},{"$f":"INDEX('Examples - Questions'!$E$4:$BB$4,1,$B4)","v":"Restricted"},{"$f":"INDEX('Examples - Questions'!$E$14:$BB$14,1,$B4)","v":"Low"},{"$f":"INDEX('Examples - Questions'!$E$23:$BB$23,1,$B4)","v":"Medium"},{"$f":"INDEX('Examples - Questions'!$E$30:$BB$30,1,$B4)","v":"Fixed"},{"$f":"INDEX('Examples - Questions'!$E$37:$BB$37,1,$B4)","v":"Any"},{"$f":"INDEX('Examples - Questions'!$E$41:$BB$41,1,$B4)","v":"Medium"}]
[null,3,{"$f":"IF(INDEX('Examples - Questions'!$E$2:$ZZ$2,1,$B5) =\"\",\"\",INDEX('Examples - Questions'!$E$2:$ZZ$2,1,$B5))","v":"eLearning\nExam questions"},{"$f":"INDEX('Examples - Questions'!$E$4:$BB$4,1,$B5)","v":"Confidential"},{"$f":"INDEX('Examples - Questions'!$E$14:$BB$14,1,$B5)","v":"High"},{"$f":"INDEX('Examples - Questions'!$E$23:$BB$23,1,$B5)","v":"High"},{"$f":"INDEX('Examples - Questions'!$E$30:$BB$30,1,$B5)","v":"Fixed"},{"$f":"INDEX('Examples - Questions'!$E$37:$BB$37,1,$B5)","v":"Any"},{"$f":"INDEX('Examples - Questions'!$E$41:$BB$41,1,$B5)","v":"High"}]
[null,4,{"$f":"IF(INDEX('Examples - Questions'!$E$2:$ZZ$2,1,$B6) =\"\",\"\",INDEX('Examples - Questions'!$E$2:$ZZ$2,1,$B6))","v":"Repository of doctoral thesis"},{"$f":"INDEX('Examples - Questions'!$E$4:$BB$4,1,$B6)","v":"Open"},{"$f":"INDEX('Examples - Questions'!$E$14:$BB$14,1,$B6)","v":"High"},{"$f":"INDEX('Examples - Questions'!$E$23:$BB$23,1,$B6)","v":"Medium"},{"$f":"INDEX('Examples - Questions'!$E$30:$BB$30,1,$B6)","v":"Permanent"},{"$f":"INDEX('Examples - Questions'!$E$37:$BB$37,1,$B6)","v":"Any"},{"$f":"INDEX('Examples - Questions'!$E$41:$BB$41,1,$B6)","v":"Low"}]
[null,5,{"$f":"IF(INDEX('Examples - Questions'!$E$2:$ZZ$2,1,$B7) =\"\",\"\",INDEX('Examples - Questions'!$E$2:$ZZ$2,1,$B7))","v":"Research project\nRaw data from IoT"},{"$f":"INDEX('Examples - Questions'!$E$4:$BB$4,1,$B7)","v":"Restricted"},{"$f":"INDEX('Examples - Questions'!$E$14:$BB$14,1,$B7)","v":"Medium"},{"$f":"INDEX('Examples - Questions'!$E$23:$BB$23,1,$B7)","v":"Medium"},{"$f":"INDEX('Examples - Questions'!$E$30:$BB$30,1,$B7)","v":"Variable"},{"$f":"INDEX('Examples - Questions'!$E$37:$BB$37,1,$B7)","v":"Any"},{"$f":"INDEX('Examples - Questions'!$E$41:$BB$41,1,$B7)","v":"Medium"}]
[null,6,{"$f":"IF(INDEX('Examples - Questions'!$E$2:$ZZ$2,1,$B8) =\"\",\"\",INDEX('Examples - Questions'!$E$2:$ZZ$2,1,$B8))","v":"Research project\nScientific paper"},{"$f":"INDEX('Examples - Questions'!$E$4:$BB$4,1,$B8)","v":"Confidential"},{"$f":"INDEX('Examples - Questions'!$E$14:$BB$14,1,$B8)","v":"Low"},{"$f":"INDEX('Examples - Questions'!$E$23:$BB$23,1,$B8)","v":"Medium"},{"$f":"INDEX('Examples - Questions'!$E$30:$BB$30,1,$B8)","v":"Variable"},{"$f":"INDEX('Examples - Questions'!$E$37:$BB$37,1,$B8)","v":"National"},{"$f":"INDEX('Examples - Questions'!$E$41:$BB$41,1,$B8)","v":"High"}]
[null,7,{"$f":"IF(INDEX('Examples - Questions'!$E$2:$ZZ$2,1,$B9) =\"\",\"\",INDEX('Examples - Questions'!$E$2:$ZZ$2,1,$B9))","v":"Network Management\nmonitoring"},{"$f":"INDEX('Examples - Questions'!$E$4:$BB$4,1,$B9)","v":"Restricted"},{"$f":"INDEX('Examples - Questions'!$E$14:$BB$14,1,$B9)","v":"Medium"},{"$f":"INDEX('Examples - Questions'!$E$23:$BB$23,1,$B9)","v":"High"},{"$f":"INDEX('Examples - Questions'!$E$30:$BB$30,1,$B9)","v":"Fixed"},{"$f":"INDEX('Examples - Questions'!$E$37:$BB$37,1,$B9)","v":"Any"},{"$f":"INDEX('Examples - Questions'!$E$41:$BB$41,1,$B9)","v":"Medium"}]
[null,8,{"$f":"IF(INDEX('Examples - Questions'!$E$2:$ZZ$2,1,$B10) =\"\",\"\",INDEX('Examples - Questions'!$E$2:$ZZ$2,1,$B10))","v":"Network Management\neduroam logs"},{"$f":"INDEX('Examples - Questions'!$E$4:$BB$4,1,$B10)","v":"Confidential"},{"$f":"INDEX('Examples - Questions'!$E$14:$BB$14,1,$B10)","v":"Medium"},{"$f":"INDEX('Examples - Questions'!$E$23:$BB$23,1,$B10)","v":"High"},{"$f":"INDEX('Examples - Questions'!$E$30:$BB$30,1,$B10)","v":"Fixed"},{"$f":"INDEX('Examples - Questions'!$E$37:$BB$37,1,$B10)","v":"Any"},{"$f":"INDEX('Examples - Questions'!$E$41:$BB$41,1,$B10)","v":"High"}]
[null,9,{"$f":"IF(INDEX('Examples - Questions'!$E$2:$ZZ$2,1,$B11) =\"\",\"\",INDEX('Examples - Questions'!$E$2:$ZZ$2,1,$B11))","v":"Network Management\nrouter config files"},{"$f":"INDEX('Examples - Questions'!$E$4:$BB$4,1,$B11)","v":"Confidential"},{"$f":"INDEX('Examples - Questions'!$E$14:$BB$14,1,$B11)","v":"Low"},{"$f":"INDEX('Examples - Questions'!$E$23:$BB$23,1,$B11)","v":"Medium"},{"$f":"INDEX('Examples - Questions'!$E$30:$BB$30,1,$B11)","v":"Fixed"},{"$f":"INDEX('Examples - Questions'!$E$37:$BB$37,1,$B11)","v":"EU"},{"$f":"INDEX('Examples - Questions'!$E$41:$BB$41,1,$B11)","v":"High"}]
[null,10,{"$f":"IF(INDEX('Examples - Questions'!$E$2:$ZZ$2,1,$B12) =\"\",\"\",INDEX('Examples - Questions'!$E$2:$ZZ$2,1,$B12))","v":"Network Management\nreports to customers"},{"$f":"INDEX('Examples - Questions'!$E$4:$BB$4,1,$B12)","v":"Open"},{"$f":"INDEX('Examples - Questions'!$E$14:$BB$14,1,$B12)","v":"Low"},{"$f":"INDEX('Examples - Questions'!$E$23:$BB$23,1,$B12)","v":"Medium"},{"$f":"INDEX('Examples - Questions'!$E$30:$BB$30,1,$B12)","v":"Variable"},{"$f":"INDEX('Examples - Questions'!$E$37:$BB$37,1,$B12)","v":"Any"},{"$f":"INDEX('Examples - Questions'!$E$41:$BB$41,1,$B12)","v":"Low"}]
[null,11,{"$f":"IF(INDEX('Examples - Questions'!$E$2:$ZZ$2,1,$B13) =\"\",\"\",INDEX('Examples - Questions'!$E$2:$ZZ$2,1,$B13))","v":"ERP system\nFinancial data"},{"$f":"INDEX('Examples - Questions'!$E$4:$BB$4,1,$B13)","v":"Confidential"},{"$f":"INDEX('Examples - Questions'!$E$14:$BB$14,1,$B13)","v":"High"},{"$f":"INDEX('Examples - Questions'!$E$23:$BB$23,1,$B13)","v":"High"},{"$f":"INDEX('Examples - Questions'!$E$30:$BB$30,1,$B13)","v":"Permanent"},{"$f":"INDEX('Examples - Questions'!$E$37:$BB$37,1,$B13)","v":"National"},{"$f":"INDEX('Examples - Questions'!$E$41:$BB$41,1,$B13)","v":"High"}]
[null,12,{"$f":"IF(INDEX('Examples - Questions'!$E$2:$ZZ$2,1,$B14) =\"\",\"\",INDEX('Examples - Questions'!$E$2:$ZZ$2,1,$B14))","v":"<data type>"},{"$f":"INDEX('Examples - Questions'!$E$4:$BB$4,1,$B14)","v":""},{"$f":"INDEX('Examples - Questions'!$E$14:$BB$14,1,$B14)","v":""},{"$f":"INDEX('Examples - Questions'!$E$23:$BB$23,1,$B14)","v":""},{"$f":"INDEX('Examples - Questions'!$E$30:$BB$30,1,$B14)","v":""},{"$f":"INDEX('Examples - Questions'!$E$37:$BB$37,1,$B14)","v":""},{"$f":"INDEX('Examples - Questions'!$E$41:$BB$41,1,$B14)","v":""}]
[null,13,{"$f":"IF(INDEX('Examples - Questions'!$E$2:$ZZ$2,1,$B15) =\"\",\"\",INDEX('Examples - Questions'!$E$2:$ZZ$2,1,$B15))","v":"<data type>"},{"$f":"INDEX('Examples - Questions'!$E$4:$BB$4,1,$B15)","v":""},{"$f":"INDEX('Examples - Questions'!$E$14:$BB$14,1,$B15)","v":""},{"$f":"INDEX('Examples - Questions'!$E$23:$BB$23,1,$B15)","v":""},{"$f":"INDEX('Examples - Questions'!$E$30:$BB$30,1,$B15)","v":""},{"$f":"INDEX('Examples - Questions'!$E$37:$BB$37,1,$B15)","v":""},{"$f":"INDEX('Examples - Questions'!$E$41:$BB$41,1,$B15)","v":""}]
{"$rows_left_out":37}